Sponsored Links

Sponsored Links

Results 1 to 2 of 2



  1. #1
    Registered User jake112493's Avatar
    Join Date
    May 2009
    Posts
    23
    Sponsored Links

    Post [Answered] PSL1GHT Compilation Error help?

    Sponsored Links
    while trying to set up psl1gh using the guide i get an error while compiling:
    Code:
    make
    ppu-gcc -Iinclude -c stub/crt0.S -o stub/crt0.o
    ppu-gcc -Iinclude -c stub/sprx.S -o stub/sprx.o
    ppu-gcc -Iinclude -c stub/crt.c -o stub/crt.o
    gcc -O2 -Wall --std=gnu99 raw2h.c -o raw2h
    gcc -Wall -Os -g -pipe   -c -o main.o main.c
    gcc main.o -Wall -Os -g -pipe -lz -o ps3load
    gcc linker.c -lelf -O2 -Wall --std=gnu99 -I. -o sprxlinker
    gcc -Wall -Os -g -pipe -I../../include/rsx -c main.cpp -o main.o
    gcc -Wall -Os -g -pipe -I../../include/rsx -c microcode.cpp -o microcode.o
    gcc -Wall -Os -g -pipe -I../../include/rsx -c parameters.cpp -o parameters.o
    gcc -Wall -Os -g -pipe -I../../include/rsx -c vpasm.cpp -o vpasm.o
    gcc main.o microcode.o parameters.o vpasm.o -Wall -Os -g -pipe -I../../include/rsx -lstdc++ -lCg -lpthread -o vpcomp
    running build_ext
    building 'pkgcrypt' extension
    creating build
    creating build/temp.linux-i686-2.6
    gcc -pthread -fno-strict-aliasing -DNDEBUG -g -fwrapv -O2 -Wall -Wstrict-prototypes -fPIC -I/usr/include/python2.6 -c crypt.c -o build/temp.linux-i686-2.6/crypt.o
    creating build/lib.linux-i686-2.6
    gcc -pthread -shared -Wl,-O1 -Wl,-Bsymbolic-functions build/temp.linux-i686-2.6/crypt.o -o build/lib.linux-i686-2.6/pkgcrypt.so
    [CC]  lv2.c
    [AR]  libpsl1ght.a
    [CC]  errno.c
    [CC]  exit.c
    [CC]  file.c
    [CC]  kill.c
    [CC]  libsysutil.c
    /home/jacob/dev/ps3/PSL1GHT/psl1ght/libc-glue-ppu/source/libsysutil.c:2:31: fatal error: sysutil/msgdialog.h: No such file or directory
    compilation terminated.
    make[2]: *** [libsysutil.o] Error 1
    make[1]: *** [build] Error 2
    make: *** [all] Error 2
    any help will be appreciated.

  2. #2
    Registered User yujerik's Avatar
    Join Date
    Jan 2011
    Posts
    1
    Sponsored Links
    Sponsored Links
    Same problem here. ps3toolchain didn't compile also.

    I finally got it to work.
    The PSL1GHT SDK must be git-cloned in the ps3chain build directory.
    From the guide you used :

    Now clone the psl1ght git repository:

    cd $PS3DEV
    git clone
    (...)
    export PSL1GHT=$PS3DEV/PSL1GHT/psl1ght/build

    Build and install it:

    cd $PS3DEV/PSL1GHT/psl1ght
    make
    make install
    Last edited by yujerik; 01-09-2011 at 05:37 AM Reason: Automerged Doublepost

 

Sponsored Links

Affiliates - Contact Us - PS3 Downloads - Privacy Statement - Site Rules - Top - © 2014 PlayStation 3 News